Hallo Liste, nachdem ich nun einige Schwierigkeiten beim kompilieren von KDE 3.2 überwunden habe, steht nun das nächste Problem vor der Tür. Für die kdebindings benötigt man python welches auch installiert ist. Wenn ich nun make aufrufe, dann kommt folgende Fehlermeldung : make[3]: Entering directory `/usr/local/src/kdebindings-3.2.0/dcoppython/shell' /usr/bin/python ./gen_marshal_code.py ./marshal_funcs.data marshal_funcs.h marshal_funcs_doc.xml Traceback (most recent call last): File "./gen_marshal_code.py", line 258, in ? for t in types: TypeError: loop over non-sequence make[3]: *** [marshal_funcs.h] Fehler 1 make[3]: Leaving directory `/usr/local/src/kdebindings-3.2.0/dcoppython/shell' make[2]: *** [all-recursive] Fehler 1 make[2]: Leaving directory `/usr/local/src/kdebindings-3.2.0/dcoppython' make[1]: *** [all-recursive] Fehler 1 make[1]: Leaving directory `/usr/local/src/kdebindings-3.2.0' make: *** [all] Fehler 2 Kann mir da jemand weiterhelfen ? Brauche ich irgendwelche zusätzlichen Pakete von python ? Danke Ralph -- E-Mail : ralph@schosemail.de Web : http://www.ralph-meyer.de